Warning: Function ereg() is deprecated in ..../includes/class_postbit.php(345) : eval()'d code on line 4

Warning: Function split() is deprecated in ..../includes/class_postbit.php(345) : eval()'d code on line 19

Warning: Function ereg() is deprecated in ..../includes/class_postbit.php(345) : eval()'d code on line 4

Warning: Function split() is deprecated in ..../includes/class_postbit.php(345) : eval()'d code on line 19

Warning: Function ereg() is deprecated in ..../includes/class_postbit.php(345) : eval()'d code on line 4

Warning: Function split() is deprecated in ..../includes/class_postbit.php(345) : eval()'d code on line 19

Warning: Function ereg() is deprecated in ..../includes/class_postbit.php(345) : eval()'d code on line 4

Warning: Function split() is deprecated in ..../includes/class_postbit.php(345) : eval()'d code on line 19

Warning: Function ereg() is deprecated in ..../includes/class_postbit.php(345) : eval()'d code on line 4

Warning: Function split() is deprecated in ..../includes/class_postbit.php(345) : eval()'d code on line 19

Warning: Function ereg() is deprecated in ..../includes/class_postbit.php(345) : eval()'d code on line 4

Warning: Function split() is deprecated in ..../includes/class_postbit.php(345) : eval()'d code on line 19

Warning: Function ereg() is deprecated in ..../includes/class_postbit.php(345) : eval()'d code on line 4

Warning: Function split() is deprecated in ..../includes/class_postbit.php(345) : eval()'d code on line 19

Warning: Function ereg() is deprecated in ..../includes/class_postbit.php(345) : eval()'d code on line 4

Warning: Function split() is deprecated in ..../includes/class_postbit.php(345) : eval()'d code on line 19

Warning: Function ereg() is deprecated in ..../includes/class_postbit.php(345) : eval()'d code on line 4

Warning: Function split() is deprecated in ..../includes/class_postbit.php(345) : eval()'d code on line 19

Warning: Function ereg() is deprecated in ..../includes/class_postbit.php(345) : eval()'d code on line 4

Warning: Function split() is deprecated in ..../includes/class_postbit.php(345) : eval()'d code on line 19
trying to install k3b
Page 1 of 2 12 LastLast
Results 1 to 10 of 18

Thread: trying to install k3b

Hybrid View

  1. #1

    trying to install k3b

    i try to install it, and i get this error message

    checking how to run the C preprocessor... /lib/cpp
    configure: error: C preprocessor "/lib/cpp" fails sanity check

    i have no idea what that means

  2. #2

    Re:trying to install k3b

    What distro are you using?

    What gcc version are you using? You can check by typing gcc on a command window.

    According to this, GCC version 2.3.2 had a bug that would cause that.


  3. #3

    Re:trying to install k3b

    i am using slack 9.0
    and i typed in gcc and it said
    gcc: no input files

  4. #4

    Re:trying to install k3b

    Try gcc -v

  5. #5

    Re:trying to install k3b

    What version of k3b are you trying to compile?

    I just downloaded k3b-0.9pre2, and it compiles fine in my Slackware 9. I guess you might be missing some packages, or your gcc might be screwed up.

    You can download a precompiled package for it here. Then install it with installpkg k3b-0.9pre2-i686-1.tgz.

    Of course, this doesn't solve your compiling problems. Have you had any other problems compiling things?

  6. #6
    Mentor
    Join Date
    Jul 2001
    Posts
    1,666

    Re:trying to install k3b

    I compiled it fine as well on slack 9. I got some hard drive corruption at some stage though and nothing would compile. Try removing and reinstalling the gcc compiler.
    CP

  7. #7

    Re:trying to install k3b

    well my version is 3.2.2
    and i tried to compile other cd burner apps and they all mess up somewhere..... i just dont understand the errors.
    lemme see...

    cdbakeoven does the same a k3b
    arson goes past the ./configure to the make, and thats where it will mess up with this long list of stuff :

    make all-recursive
    make[1]: Entering directory `/root/arson-0.9.7-kde3'
    Making all in doc
    make[2]: Entering directory `/root/arson-0.9.7-kde3/doc'
    make[3]: Entering directory `/root/arson-0.9.7-kde3/doc'
    make[3]: Nothing to be done for `all-am'.
    make[3]: Leaving directory `/root/arson-0.9.7-kde3/doc'
    make[2]: Leaving directory `/root/arson-0.9.7-kde3/doc'
    Making all in po
    make[2]: Entering directory `/root/arson-0.9.7-kde3/po'
    make[2]: Nothing to be done for `all'.
    make[2]: Leaving directory `/root/arson-0.9.7-kde3/po'
    Making all in src
    make[2]: Entering directory `/root/arson-0.9.7-kde3/src'
    Making all in .
    make[3]: Entering directory `/root/arson-0.9.7-kde3/src'
    source='arson.cpp' object='arson.o' libtool=no \
    depfile='.deps/arson.Po' tmpdepfile='.deps/arson.TPo' \
    depmode=gcc3 /bin/sh ../admin/depcomp \
    g++ -DHAVE_CONFIG_H -I. -I. -I.. -I/opt/kde/include -I/usr/lib/qt-3.1.2/include
    -I/usr/X11R6/include -DQT_THREAD_SUPPORT -D_REENTRANT -pipe -O2 -DNDEBUG -fn
    o-check-new -c -o arson.o `test -f arson.cpp || echo './'`arson.cpp
    In file included from /usr/include/signal.h:313,
    from /usr/include/sys/wait.h:30,
    from /opt/kde/include/kprocess.h:33,
    from process.h:24,
    from isofs.h:26,
    from arson.cpp:60:
    /usr/include/bits/sigcontext.h:28:29: asm/sigcontext.h: No such file or director
    y
    In file included from /usr/include/errno.h:36,
    from /opt/kde/include/ktempfile.h:25,
    from tempfile.h:25,
    from arson.cpp:65:
    /usr/include/bits/errno.h:25:26: linux/errno.h: No such file or directory
    make[3]: *** [arson.o] Error 1
    make[3]: Leaving directory `/root/arson-0.9.7-kde3/src'
    make[2]: *** [all-recursive] Error 1
    make[2]: Leaving directory `/root/arson-0.9.7-kde3/src'
    make[1]: *** [all-recursive] Error 1
    make[1]: Leaving directory `/root/arson-0.9.7-kde3'
    make: *** [all] Error 2
    root@void:~/arson-0.9.7-kde3# make install
    Making install in doc
    make[1]: Entering directory `/root/arson-0.9.7-kde3/doc'
    make[2]: Entering directory `/root/arson-0.9.7-kde3/doc'
    make[3]: Entering directory `/root/arson-0.9.7-kde3/doc'
    make[3]: Nothing to be done for `install-exec-am'.
    make[3]: Nothing to be done for `install-data-am'.
    make[3]: Leaving directory `/root/arson-0.9.7-kde3/doc'
    make[2]: Leaving directory `/root/arson-0.9.7-kde3/doc'
    make[1]: Leaving directory `/root/arson-0.9.7-kde3/doc'
    Making install in po
    make[1]: Entering directory `/root/arson-0.9.7-kde3/po'
    make[2]: Entering directory `/root/arson-0.9.7-kde3/po'
    make[2]: Nothing to be done for `install-exec-am'.
    /usr/bin/ginstall -c -p -m 644 de.gmo /opt/kde/share/locale/de/LC_MESSAGES/arson
    .mo
    /usr/bin/ginstall -c -p -m 644 es.gmo /opt/kde/share/locale/es/LC_MESSAGES/arson
    .mo
    /usr/bin/ginstall -c -p -m 644 sv.gmo /opt/kde/share/locale/sv/LC_MESSAGES/arson
    .mo
    make[2]: Leaving directory `/root/arson-0.9.7-kde3/po'
    make[1]: Leaving directory `/root/arson-0.9.7-kde3/po'
    Making install in src
    make[1]: Entering directory `/root/arson-0.9.7-kde3/src'
    Making install in .
    make[2]: Entering directory `/root/arson-0.9.7-kde3/src'
    source='arson.cpp' object='arson.o' libtool=no \
    depfile='.deps/arson.Po' tmpdepfile='.deps/arson.TPo' \
    depmode=gcc3 /bin/sh ../admin/depcomp \
    g++ -DHAVE_CONFIG_H -I. -I. -I.. -I/opt/kde/include -I/usr/lib/qt-3.1.2/include -I/usr/X11R6/include -DQT_THREAD_SUPPORT -D_REENTRANT -pipe -O2 -DNDEBUG -fn o-check-new -c -o arson.o `test -f arson.cpp || echo './'`arson.cpp
    In file included from /usr/include/signal.h:313,
    from /usr/include/sys/wait.h:30,
    from /opt/kde/include/kprocess.h:33,
    from process.h:24,
    from isofs.h:26,
    from arson.cpp:60:
    /usr/include/bits/sigcontext.h:28:29: asm/sigcontext.h: No such file or director y
    In file included from /usr/include/errno.h:36,
    from /opt/kde/include/ktempfile.h:25,
    from tempfile.h:25,
    from arson.cpp:65:
    /usr/include/bits/errno.h:25:26: linux/errno.h: No such file or directory
    make[2]: *** [arson.o] Error 1
    make[2]: Leaving directory `/root/arson-0.9.7-kde3/src'
    make[1]: *** [install-recursive] Error 1
    make[1]: Leaving directory `/root/arson-0.9.7-kde3/src'
    make: *** [install-recursive] Error 1

    thanks again trickster

  8. #8

    Re:trying to install k3b

    well i tried to install the .tgz and it will go to
    PACKAGE DESCRIPTION and then
    just stop with this

    root@void:~# installpkg k3b-0.9pre2-i686-1.tgz
    Installing package k3b-0.9pre2-i686-1...
    PACKAGE DESCRIPTION:
    Executing install script for k3b-0.9pre2-i686-1...

    and then thats it....

    oh and CP

    how do unistall all the parts of the gcc at once and reinstall....

    im such a newbie

    thanks guys

  9. #9
    Mentor
    Join Date
    Jul 2001
    Posts
    1,666

    Re:trying to install k3b

    Just login as root and type
    removepkg gcc-3.2.2, then download the package off the CD, and install it the usual way. Hopefully it is just a bad file in there somewhere. Are you sure that the tgz didn't install it though. It usually does just give the package description. Try to run it and see what happens. The other thing to check is if you have your kernel-headers installed. The easiest way to find out is to go into /var/log/packages and type ls *kernel*. There probably isn't a package there called kernel-headers, in which case you need to download and install it. HTH
    CP

  10. #10

    Re:trying to install k3b

    thanks cp, thats what i did, and it installed fine. took a while, but it installed. ran fine but gave me this error message and i dont know how to fix it, or turn on what it wants me too


    cdrdao 1.1.7 does not support ATAPI
    The configured version of cdrdao does not support writing to ATAPI devices without SCSI emulation and there is at least one writer in your system not configured to use SCSI emulation.
    Solution: The best and recommended solution is to enable ide-scsi (SCSI emulation) for all writer devices. This way you won't have any problems. Or you install (or select as the default) a more recent version of cdrdao.

    any suggestions?

Similar Threads

  1. Install Xgl
    By GhostDawg in forum Linux - Software, Applications & Programming
    Replies: 6
    Last Post: 03-30-2006, 04:13 AM
  2. Re-Install LILO after W2K Install
    By Pleiades in forum Linux - General Topics
    Replies: 12
    Last Post: 08-18-2002, 04:58 PM
  3. Need Help with Install
    By rc2 in forum Mandriva
    Replies: 9
    Last Post: 05-22-2002, 05:18 PM
  4. GCC Install help
    By ericn in forum Linux - Software, Applications & Programming
    Replies: 1
    Last Post: 03-17-2002, 02:28 AM
  5. php install
    By elovkoff in forum Linux - Hardware, Networking & Security
    Replies: 4
    Last Post: 02-27-2002, 12:54 PM

Bookmarks

Posting Permissions

  • You may not post new threads
  • You may not post replies
  • You may not post attachments
  • You may not edit your posts
  •