Hi guys and gals.

I have had a fully functioning Gentoo install for over a year I believe.

The other day I tried to update my install like I usully do and my computer is stuck on compiling gcc.

These are my cflags:

Code:
LAGS="-march=athlon -O3  -fmove-all-movables -fprefetch-loop-arrays -fomit-frame-pointer -ffast-math -pipe"
Here is the error I get:

Code:
d; first ignored character is `8'
/var/tmp/portage/gcc-3.3.3-r6/temp/ccoU2y9a.s:1165: Error: suffix or operands i  valid for `mov'
/var/tmp/portage/gcc-3.3.3-r6/temp/ccoU2y9a.s:1165: Warning: rest of line ignor  d; first ignored character is `9'
/var/tmp/portage/gcc-3.3.3-r6/temp/ccoU2y9a.s:1167: Error: suffix or operands i  valid for `mov'
/var/tmp/portage/gcc-3.3.3-r6/temp/ccoU2y9a.s:1167: Warning: rest of line ignor  d; first ignored character is `,'
/var/tmp/portage/gcc-3.3.3-r6/temp/ccoU2y9a.s:1189: Error: suffix or operands i  valid for `mov'
/var/tmp/portage/gcc-3.3.3-r6/temp/ccoU2y9a.s:1189: Warning: rest of line ignor  d; first ignored character is `,'
/var/tmp/portage/gcc-3.3.3-r6/temp/ccoU2y9a.s:1209: Error: suffix or operands i  valid for `mov'
/var/tmp/portage/gcc-3.3.3-r6/temp/ccoU2y9a.s:1209: Warning: rest of line ignor  d; first ignored character is `,'
/var/tmp/portage/gcc-3.3.3-r6/temp/ccoU2y9a.s:1231: Error: suffix or operands i  valid for `mov'
/var/tmp/portage/gcc-3.3.3-r6/temp/ccoU2y9a.s:1231: Warning: rest of line ignor  d; first ignored character is `,'
/var/tmp/portage/gcc-3.3.3-r6/temp/ccoU2y9a.s:1264: Error: missing or invalid i  mediate expression `' taken as 0
/var/tmp/portage/gcc-3.3.3-r6/temp/ccoU2y9a.s:1264: Error: suffix or operands i  valid for `mov'
/var/tmp/portage/gcc-3.3.3-r6/temp/ccoU2y9a.s:1264: Warning: rest of line ignor  d; first ignored character is `,'
/var/tmp/portage/gcc-3.3.3-r6/temp/ccoU2y9a.s:1283: Error: missing or invalid i  mediate expression `' taken as 0
/var/tmp/portage/gcc-3.3.3-r6/temp/ccoU2y9a.s:1283: Error: suffix or operands i  valid for `mov'
/var/tmp/portage/gcc-3.3.3-r6/temp/ccoU2y9a.s:1283: Warning: rest of line ignor  d; first ignored character is `,'
make[2]: *** [genattr.o] Error 1
make[2]: *** Waiting for unfinished jobs....
make[2]: Leaving directory `/var/tmp/portage/gcc-3.3.3-r6/work/build/gcc'
make[1]: *** [stage1_build] Error 2
make[1]: Leaving directory `/var/tmp/portage/gcc-3.3.3-r6/work/build/gcc'
make: *** [bootstrap-lean] Error 2

!!! ERROR: sys-devel/gcc-3.3.3-r6 failed.
!!! Function src_compile, Line 553, Exitcode 2
!!! (no error message)

Thanks to Lovechild I know I'm a ricer. But still Gentoo has worked great. If anyone can help your help will be appreciated.

Thanks.